Reaction Details
TargetAcetylcholinesterase
LigandBDBM50317197
Substrate/Competitorn/a
Meas. Tech.ChEMBL_631311 (CHEMBL1103849)
IC50 564±n/a nM
Citation Rook, YSchmidtke, KUGaube, FSchepmann, DWünsch, BHeilmann, JLehmann, JWinckler, T Bivalent beta-carbolines as potential multitarget anti-Alzheimer agents. J Med Chem53:3611-7 (2010) 
 
Acetylcholinesterase
Name:Acetylcholinesterase
Type:Enzyme
Mol. Mass.:71812.79
Organism:Electrophorus electricus (Electric eel)
Description:n/a
Residue:633
BDBM50317197
NameBDBM50317197
Synonyms:2-(6-Pyridinium-1-yl-hexyl)-beta-carboline-2-ium dibromide | CHEMBL1097509
TypeSmall organic molecule
Emp. Form.C22H25N3
Mol. Mass.331.4529
SMILESC(CCC[n+]1ccc2c(c1)[nH]c1ccccc21)CC[n+]1ccccc1