Reaction Details
TargetAcetylcholinesterase
LigandBDBM50317200
Substrate/Competitorn/a
Meas. Tech.ChEMBL_631311 (CHEMBL1103849)
IC50>1000±n/a nM
Citation Rook, YSchmidtke, KUGaube, FSchepmann, DWünsch, BHeilmann, JLehmann, JWinckler, T Bivalent beta-carbolines as potential multitarget anti-Alzheimer agents. J Med Chem53:3611-7 (2010) 
 
Acetylcholinesterase
Name:Acetylcholinesterase
Type:Enzyme
Mol. Mass.:71812.79
Organism:Electrophorus electricus (Electric eel)
Description:n/a
Residue:633
BDBM50317200
NameBDBM50317200
Synonyms:2-[10-(1,2,3,4-Tetrahydro-beta-carboline-2-yl)decyl]-1,2,3,4-tetrahydro-beta-carboline | CHEMBL1097508
TypeSmall organic molecule
Emp. Form.C32H42N4
Mol. Mass.482.7027
SMILESC(CCCCCN1CCc2c(C1)[nH]c1ccccc21)CCCCN1CCc2c(C1)[nH]c1ccccc21