Reaction Details
TargetAcetylcholinesterase
LigandBDBM50317204
Substrate/Competitorn/a
Meas. Tech.ChEMBL_631311 (CHEMBL1103849)
IC50>1000±n/a nM
Citation Rook, YSchmidtke, KUGaube, FSchepmann, DWünsch, BHeilmann, JLehmann, JWinckler, T Bivalent beta-carbolines as potential multitarget anti-Alzheimer agents. J Med Chem53:3611-7 (2010) 
 
Acetylcholinesterase
Name:Acetylcholinesterase
Type:Enzyme
Mol. Mass.:71812.79
Organism:Electrophorus electricus (Electric eel)
Description:n/a
Residue:633
BDBM50317204
NameBDBM50317204
Synonyms:9-Ethyl-beta-carboline | CHEMBL1097825
TypeSmall organic molecule
Emp. Form.C13H12N2
Mol. Mass.196.2478
SMILESCCn1c2ccccc2c2ccncc12