Reaction Details
TargetCholinesterase
LigandBDBM50044140
Substrate/Competitorn/a
Meas. Tech.ChEMBL_631312 (CHEMBL1105649)
IC50>10000±n/a nM
Citation Rook, YSchmidtke, KUGaube, FSchepmann, DWünsch, BHeilmann, JLehmann, JWinckler, T Bivalent beta-carbolines as potential multitarget anti-Alzheimer agents. J Med Chem53:3611-7 (2010) 
 
Cholinesterase
Name:Cholinesterase
Type:Enzyme
Mol. Mass.:65643.35
Organism:Equus caballus (Horse)
Description:P81908
Residue:574
BDBM50044140
NameBDBM50044140
Synonyms:2-(2-Chloro-phenyl)-2-methylamino-cyclohexanone CHEMBL742 Ketalar
TypeSmall organic molecule
Emp. Form.C13H16ClNO
Mol. Mass.237.725
SMILESCNC1(CCCCC1=O)c1ccccc1Cl