Reaction Details
Target11-beta-hydroxysteroid dehydrogenase 1
LigandBDBM50317210
Substrate/Competitorn/a
Meas. Tech.ChEMBL_631345 (CHEMBL1105682)
Ki 5.4±n/a nM
Citation Cheng, HHoffman, JLe, PNair, SKCripps, SMatthews, JSmith, CYang, MKupchinsky, SDress, KEdwards, MCole, BWalters, ELoh, CErmolieff, JFanjul, ABhat, GBHerrera, JPauly, THosea, NPaderes, GRejto, P The development and SAR of pyrrolidine carboxamide 11beta-HSD1 inhibitors. Bioorg Med Chem Lett20:2897-902 (2010) 
 
11-beta-hydroxysteroid dehydrogenase 1
Name:11-beta-hydroxysteroid dehydrogenase 1
Type:Enzyme
Mol. Mass.:32369.70
Organism:Mus musculus (mouse)
Description:P50172
Residue:292
BDBM50317210
NameBDBM50317210
Synonyms:(2R)-N-(adamantan-2-yl)-1-methylpyrrolidine-2-carboxamide | CHEMBL1088116
TypeSmall organic molecule
Emp. Form.C16H26N2O
Mol. Mass.262.3904
SMILESCN1CCC[C@@H]1C(=O)NC1C2CC3CC(C2)CC1C3