Reaction Details
TargetMacrophage-stimulating protein receptor
LigandBDBM50317335
Substrate/Competitorn/a
Meas. Tech.ChEMBL_631549 (CHEMBL1103914)
IC50 30±n/a nM
Citation Raeppel, SGaudette, FMannion, MClaridge, SSaavedra, OIsakovic, LDéziel, RBeaulieu, NBeaulieu, CDupont, INguyen, HWang, JMacleod, ARMaroun, CBesterman, JMVaisburg, A Identification of a novel series of potent RON receptor tyrosine kinase inhibitors. Bioorg Med Chem Lett20:2745-9 (2010) 
 
Macrophage-stimulating protein receptor
Name:Macrophage-stimulating protein receptor
Type:Protein
Mol. Mass.:152270.76
Organism:Homo sapiens (Human)
Description:Q04912
Residue:1400
BDBM50317335
NameBDBM50317335
Synonyms:CHEMBL1095356 | N-(4-(2-(4-(dimethylcarbamoyl)phenyl)thieno[3,2-b]pyridin-7-yloxy)-3-fluorophenyl)-1-phenyl-5-(trifluoromethyl)-1H-pyrazole-4-carboxamide
TypeSmall organic molecule
Emp. Form.C33H23F4N5O3S
Mol. Mass.645.626
SMILESCN(C)C(=O)c1ccc(cc1)-c1cc2nccc(Oc3ccc(NC(=O)c4cnn(c4C(F)(F)F)-c4ccccc4)cc3F)c2s1