Reaction Details
TargetSialidase
LigandBDBM50311586
Substrate/Competitorn/a
Meas. Tech.ChEMBL_631812 (CHEMBL1111005)
Ki 1800±n/a nM
Citation Nguyen, PHNguyen, TNKang, KWNdinteh, DTMbafor, JTKim, YROh, WK Prenylated pterocarpans as bacterial neuraminidase inhibitors. Bioorg Med Chem18:3335-44 (2010) 
 
Sialidase
Name:Sialidase
Type:PROTEIN
Mol. Mass.:42808.79
Organism:Clostridium perfringens
Description:ChEMBL_991336
Residue:382
BDBM50311586
NameBDBM50311586
Synonyms:CHEMBL1088462 | erystagallin A
TypeSmall organic molecule
Emp. Form.C26H30O5
Mol. Mass.422.5134
SMILES[#6]-[#8]-c1ccc2c(-[#8]-[#6@H]3-c4cc(-[#6]\[#6]=[#6](\[#6])-[#6])c(-[#8])cc4-[#8]-[#6][C@@]23[#8])c1-[#6]\[#6]=[#6](\[#6])-[#6]