Reaction Details
TargetSialidase
LigandBDBM50317439
Substrate/Competitorn/a
Meas. Tech.ChEMBL_631810 (CHEMBL1109003)
IC50 26390±n/a nM
Citation Nguyen, PHNguyen, TNKang, KWNdinteh, DTMbafor, JTKim, YROh, WK Prenylated pterocarpans as bacterial neuraminidase inhibitors. Bioorg Med Chem18:3335-44 (2010) 
 
Sialidase
Name:Sialidase
Type:PROTEIN
Mol. Mass.:85590.05
Organism:Vibrio cholerae
Description:ChEMBL_631810
Residue:781
BDBM50317439
NameBDBM50317439
Synonyms:CHEMBL1095422 | erysubin D
TypeSmall organic molecule
Emp. Form.C25H28O5
Mol. Mass.408.4868
SMILES[#6]\[#6](-[#6])=[#6]\[#6]-c1cc2-[#6@@H]-3-[#8]-c4c(ccc5-[#8]C([#6])([#6])[#6](-[#8])-[#6]-c45)-[#6@@H]-3-[#6]-[#8]-c2cc1-[#8]