Reaction Details
TargetMitogen-activated protein kinase 14
LigandBDBM50317583
Substrate/Competitorn/a
Meas. Tech.ChEMBL_632331 (CHEMBL1112959)
IC50 14±n/a nM
Citation Tynebor, RMChen, MHNatarajan, SRO'Neill, EAThompson, JEFitzgerald, CEO'Keefe, SJDoherty, JB Synthesis and biological activity of 2H-quinolizin-2-one based p38alpha MAP kinase inhibitors. Bioorg Med Chem Lett20:2765-9 (2010) 
 
Mitogen-activated protein kinase 14
Name:Mitogen-activated protein kinase 14
Type:Enzyme
Mol. Mass.:41281.22
Organism:Mus musculus (mouse)
Description:The full-length open reading frame of murine p38 alpha was cloned and expressed in E. coli.. Soluble murine p38R was extracted from cell pellets and purified using ion-exchange chromatography.
Residue:360
BDBM50317583
NameBDBM50317583
Synonyms:1-(2,6-difluoro-4-(5-methyl-1,3,4-oxadiazol-2-yl)phenyl)-6-(2,4-difluorophenyl)-2H-quinolizin-2-one | CHEMBL1098546
TypeSmall organic molecule
Emp. Form.C24H13F4N3O2
Mol. Mass.451.3725
SMILESCc1nnc(o1)-c1cc(F)c(c(F)c1)-c1c2cccc(-c3ccc(F)cc3F)n2ccc1=O