Reaction Details
TargetPotassium voltage-gated channel subfamily H member 2
LigandBDBM50317588
Substrate/Competitorn/a
Meas. Tech.ChEMBL_632336 (CHEMBL1112964)
Ki>20000±n/a nM
Citation Tynebor, RMChen, MHNatarajan, SRO'Neill, EAThompson, JEFitzgerald, CEO'Keefe, SJDoherty, JB Synthesis and biological activity of 2H-quinolizin-2-one based p38alpha MAP kinase inhibitors. Bioorg Med Chem Lett20:2765-9 (2010) 
 
Potassium voltage-gated channel subfamily H member 2
Name:Potassium voltage-gated channel subfamily H member 2
Type:Multi-pass membrane protein
Mol. Mass.:126672.65
Organism:Homo sapiens (Human)
Description:Q12809
Residue:1159
BDBM50317588
NameBDBM50317588
Synonyms:6-(2,4-difluorophenyl)-1-(2-fluoro-5-(5-methyl-1,3,4-oxadiazol-2-yl)phenyl)-2H-quinolizin-2-one | CHEMBL1096192
TypeSmall organic molecule
Emp. Form.C24H14F3N3O2
Mol. Mass.433.3821
SMILESCc1nnc(o1)-c1ccc(F)c(c1)-c1c2cccc(-c3ccc(F)cc3F)n2ccc1=O