Reaction Details
TargetLeukotriene B4 receptor 2
LigandBDBM50317625
Substrate/Competitorn/a
Meas. Tech.ChEMBL_632892 (CHEMBL1107474)
IC50 628±n/a nM
Citation Goodnow, RAHicks, ASidduri, AKowalczyk, ADominique, RQiao, QLou, JPGillespie, PFotouhi, NTilley, JCohen, NChoudhry, SCavallo, GTannu, SAVentre, JDLavelle, DTare, NSOh, HLamb, MKurylko, GHamid, RWright, MBPamidimukkala, AEgan, TGubler, UHoffman, AFWei, XLi, YLO'Neil, JMarcano, RPozzani, KMolinaro, TSantiago, JSinger, LHargaden, MMoore, DCatala, ARChao, LCHermann, GVenkat, RMancebo, HRenzetti, LM Discovery of novel and potent leukotriene B4 receptor antagonists. Part 1. J Med Chem53:3502-16 (2010) 
 
Leukotriene B4 receptor 2
Name:Leukotriene B4 receptor 2
Type:Enzyme Catalytic Domain
Mol. Mass.:37964.86
Organism:Homo sapiens (Human)
Description:Leukotriene 2 0 HUMAN::Q9NPC1
Residue:358
BDBM50317625
NameBDBM50317625
Synonyms:4-{2-(2-Carboxyethyl)-3-[6-([1,1',3,1'']terphenyl-5'-yloxy)-hexyl]phenoxy}butyric Acid | CHEMBL1099323
TypeSmall organic molecule
Emp. Form.C37H40O6
Mol. Mass.580.7099
SMILESOC(=O)CCCOc1cccc(CCCCCCOc2cc(cc(c2)-c2ccccc2)-c2ccccc2)c1CCC(O)=O