Reaction Details
TargetCytochrome P450 2C9
LigandBDBM50317625
Substrate/Competitorn/a
Meas. Tech.ChEMBL_632904 (CHEMBL1107486)
IC50>50000±n/a nM
Citation Goodnow, RAHicks, ASidduri, AKowalczyk, ADominique, RQiao, QLou, JPGillespie, PFotouhi, NTilley, JCohen, NChoudhry, SCavallo, GTannu, SAVentre, JDLavelle, DTare, NSOh, HLamb, MKurylko, GHamid, RWright, MBPamidimukkala, AEgan, TGubler, UHoffman, AFWei, XLi, YLO'Neil, JMarcano, RPozzani, KMolinaro, TSantiago, JSinger, LHargaden, MMoore, DCatala, ARChao, LCHermann, GVenkat, RMancebo, HRenzetti, LM Discovery of novel and potent leukotriene B4 receptor antagonists. Part 1. J Med Chem53:3502-16 (2010) 
 
Cytochrome P450 2C9
Name:Cytochrome P450 2C9
Type:Enzyme
Mol. Mass.:55636.33
Organism:Homo sapiens (Human)
Description:P11712
Residue:490
BDBM50317625
NameBDBM50317625
Synonyms:4-{2-(2-Carboxyethyl)-3-[6-([1,1',3,1'']terphenyl-5'-yloxy)-hexyl]phenoxy}butyric Acid | CHEMBL1099323
TypeSmall organic molecule
Emp. Form.C37H40O6
Mol. Mass.580.7099
SMILESOC(=O)CCCOc1cccc(CCCCCCOc2cc(cc(c2)-c2ccccc2)-c2ccccc2)c1CCC(O)=O