Reaction Details
TargetLeukotriene B4 receptor 1
LigandBDBM50317630
Substrate/Competitorn/a
Meas. Tech.ChEMBL_632889 (CHEMBL1107471)
IC50 0.61±n/a nM
Citation Goodnow, RAHicks, ASidduri, AKowalczyk, ADominique, RQiao, QLou, JPGillespie, PFotouhi, NTilley, JCohen, NChoudhry, SCavallo, GTannu, SAVentre, JDLavelle, DTare, NSOh, HLamb, MKurylko, GHamid, RWright, MBPamidimukkala, AEgan, TGubler, UHoffman, AFWei, XLi, YLO'Neil, JMarcano, RPozzani, KMolinaro, TSantiago, JSinger, LHargaden, MMoore, DCatala, ARChao, LCHermann, GVenkat, RMancebo, HRenzetti, LM Discovery of novel and potent leukotriene B4 receptor antagonists. Part 1. J Med Chem53:3502-16 (2010) 
 
Leukotriene B4 receptor 1
Name:Leukotriene B4 receptor 1
Type:Enzyme Catalytic Domain
Mol. Mass.:37582.68
Organism:Homo sapiens (Human)
Description:Q15722
Residue:352
BDBM50317630
NameBDBM50317630
Synonyms:4-(3-(6-(5-(benzo[d][1,3]dioxol-5-yl)-2'-fluorobiphenyl-3-yloxy)hexyl)-2-(2-carboxyethyl)phenoxy)butanoic acid | CHEMBL1094349
TypeSmall organic molecule
Emp. Form.C38H39FO8
Mol. Mass.642.7099
SMILESOC(=O)CCCOc1cccc(CCCCCCOc2cc(cc(c2)-c2ccccc2F)-c2ccc3OCOc3c2)c1CCC(O)=O