Reaction Details
TargetHistamine H3 receptor
LigandBDBM50317686
Substrate/Competitorn/a
Meas. Tech.ChEMBL_629414 (CHEMBL1105767)
Ki 2.6±n/a nM
Citation Stocking, EMAluisio, LAtack, JRBonaventure, PCarruthers, NIDugovic, CEverson, AFraser, IJiang, XLeung, PLord, BLy, KSMorton, KLNepomuceno, DShah, CRShelton, JSoyode-Johnson, ALetavic, MA Novel substituted pyrrolidines are high affinity histamine H3 receptor antagonists. Bioorg Med Chem Lett20:2755-60 (2010) 
 
Histamine H3 receptor
Name:Histamine H3 receptor
Type:G Protein-Coupled Receptor (GPCR)
Mol. Mass.:48691.47
Organism:Homo sapiens (Human)
Description:Binding assays were using CHO cells stably expressing hH3R receptors.
Residue:445
BDBM50317686
NameBDBM50317686
Synonyms:(4-cyclobutyl-1,4-diazepan-1-yl)((2R,4S)-4-(pyridin-3-yloxy)pyrrolidin-2-yl)methanone | CHEMBL1098493
TypeSmall organic molecule
Emp. Form.C19H28N4O2
Mol. Mass.344.4512
SMILESO=C([C@H]1C[C@@H](CN1)Oc1cccnc1)N1CCCN(CC1)C1CCC1