Reaction Details
TargetHistamine H3 receptor
LigandBDBM50317702
Substrate/Competitorn/a
Meas. Tech.ChEMBL_629414 (CHEMBL1105767)
Ki 2.5±n/a nM
Citation Stocking, EMAluisio, LAtack, JRBonaventure, PCarruthers, NIDugovic, CEverson, AFraser, IJiang, XLeung, PLord, BLy, KSMorton, KLNepomuceno, DShah, CRShelton, JSoyode-Johnson, ALetavic, MA Novel substituted pyrrolidines are high affinity histamine H3 receptor antagonists. Bioorg Med Chem Lett20:2755-60 (2010) 
 
Histamine H3 receptor
Name:Histamine H3 receptor
Type:G Protein-Coupled Receptor (GPCR)
Mol. Mass.:48691.47
Organism:Homo sapiens (Human)
Description:Binding assays were using CHO cells stably expressing hH3R receptors.
Residue:445
BDBM50317702
NameBDBM50317702
Synonyms:((2R,4S)-4-(3-chlorophenoxy)pyrrolidin-2-yl)(4-cyclobutyl-1,4-diazepan-1-yl)methanone | CHEMBL1095877
TypeSmall organic molecule
Emp. Form.C20H28ClN3O2
Mol. Mass.377.908
SMILESClc1cccc(O[C@@H]2CN[C@H](C2)C(=O)N2CCCN(CC2)C2CCC2)c1