Reaction Details
TargetOxysterols receptor LXR-beta
LigandBDBM50317737
Substrate/Competitorn/a
Meas. Tech.ChEMBL_629443 (CHEMBL1105796)
IC50 2.4±n/a nM
Citation Ullrich, JWMorris, RBernotas, RCTravins, JMJetter, JUnwalla, RQuinet, ENambi, PFeingold, IHuselton, CEnroth, CWilhelmsson, AGoos-Nilsson, AWrobel, J Synthesis of 4-(3-biaryl)quinoline sulfones as potent liver X receptor agonists. Bioorg Med Chem Lett20:2903-7 (2010) 
 
Oxysterols receptor LXR-beta
Name:Oxysterols receptor LXR-beta
Type:Enzyme Catalytic Domain
Mol. Mass.:50978.79
Organism:Homo sapiens (Human)
Description:P55055
Residue:460
BDBM50317737
NameBDBM50317737
Synonyms:3-ethyl-4-(3'-(methylsulfonyl)biphenyl-3-yl)-8-(trifluoromethyl)quinoline | CHEMBL1098403
TypeSmall organic molecule
Emp. Form.C25H20F3NO2S
Mol. Mass.455.492
SMILESCCc1cnc2c(cccc2c1-c1cccc(c1)-c1cccc(c1)S(C)(=O)=O)C(F)(F)F