Reaction Details
TargetVoltage-dependent L-type calcium channel subunit alpha-1D
LigandBDBM50317794
Substrate/Competitorn/a
Meas. Tech.ChEMBL_629724 (CHEMBL1121084)
IC50 37±n/a nM
Citation Chang, CCCao, SKang, SKai, LTian, XPandey, PDunne, SFLuan, CHSurmeier, DJSilverman, RB Antagonism of 4-substituted 1,4-dihydropyridine-3,5-dicarboxylates toward voltage-dependent L-type Ca2+ channels Ca V 1.3 and Ca V 1.2. Bioorg Med Chem18:3147-58 (2010) 
 
Voltage-dependent L-type calcium channel subunit alpha-1D
Name:Voltage-dependent L-type calcium channel subunit alpha-1D
Type:PROTEIN
Mol. Mass.:250148.41
Organism:Rattus norvegicus
Description:ChEMBL_44709
Residue:2203
BDBM50317794
NameBDBM50317794
Synonyms:CHEMBL1094740 | diethyl 2-(acetoxymethyl)-6-methyl-4-(3-nitrophenyl)-1,4-dihydropyridine-3,5-dicarboxylate
TypeSmall organic molecule
Emp. Form.C21H24N2O8
Mol. Mass.432.4239
SMILESCCOC(=O)C1C(C(C(=O)OCC)=C(COC(C)=O)N=C1C)c1cccc(c1)[N+]([O-])=O