Reaction Details
TargetVoltage-dependent L-type calcium channel subunit alpha-1C
LigandBDBM50317787
Substrate/Competitorn/a
Meas. Tech.ChEMBL_629725 (CHEMBL1121085)
IC50 18±n/a nM
Citation Chang, CCCao, SKang, SKai, LTian, XPandey, PDunne, SFLuan, CHSurmeier, DJSilverman, RB Antagonism of 4-substituted 1,4-dihydropyridine-3,5-dicarboxylates toward voltage-dependent L-type Ca2+ channels Ca V 1.3 and Ca V 1.2. Bioorg Med Chem18:3147-58 (2010) 
 
Voltage-dependent L-type calcium channel subunit alpha-1C
Name:Voltage-dependent L-type calcium channel subunit alpha-1C
Type:PROTEIN
Mol. Mass.:242793.78
Organism:Oryctolagus cuniculus
Description:ChEMBL_42776
Residue:2171
BDBM50317787
NameBDBM50317787
Synonyms:CHEMBL1096376 | diethyl 2-methyl-4-(3-nitrophenyl)-6-propyl-1,4-dihydropyridine-3,5-dicarboxylate
TypeSmall organic molecule
Emp. Form.C21H26N2O6
Mol. Mass.402.4409
SMILESCCCC1=C(C(C(C(=O)OCC)C(C)=N1)c1cccc(c1)[N+]([O-])=O)C(=O)OCC