Reaction Details
TargetVoltage-dependent L-type calcium channel subunit alpha-1C
LigandBDBM50317803
Substrate/Competitorn/a
Meas. Tech.ChEMBL_629725 (CHEMBL1121085)
IC50 15±n/a nM
Citation Chang, CCCao, SKang, SKai, LTian, XPandey, PDunne, SFLuan, CHSurmeier, DJSilverman, RB Antagonism of 4-substituted 1,4-dihydropyridine-3,5-dicarboxylates toward voltage-dependent L-type Ca2+ channels Ca V 1.3 and Ca V 1.2. Bioorg Med Chem18:3147-58 (2010) 
 
Voltage-dependent L-type calcium channel subunit alpha-1C
Name:Voltage-dependent L-type calcium channel subunit alpha-1C
Type:PROTEIN
Mol. Mass.:242793.78
Organism:Oryctolagus cuniculus
Description:ChEMBL_42776
Residue:2171
BDBM50317803
NameBDBM50317803
Synonyms:3-allyl 5-methyl 2,6-dimethyl-4-(3-nitrophenyl)-1,4-dihydropyridine-3,5-dicarboxylate | CHEMBL1098209
TypeSmall organic molecule
Emp. Form.C19H20N2O6
Mol. Mass.372.3719
SMILESCOC(=O)C1C(C(C(=O)OCC=C)=C(C)N=C1C)c1cccc(c1)[N+]([O-])=O