Reaction Details
TargetAdenosine receptor A1
LigandBDBM50317876
Substrate/Competitorn/a
Meas. Tech.ChEMBL_630177 (CHEMBL1117280)
Ki 50±n/a nM
Citation Devine, SMGregg, AFigler, HMcIntosh, KUrmaliya, VLinden, JPouton, CWWhite, PJBottle, SEScammells, PJ Synthesis and evaluation of new N6-substituted adenosine-5'-N-methylcarboxamides as A3 adenosine receptor agonists. Bioorg Med Chem18:3078-87 (2010) 
 
Adenosine receptor A1
Name:Adenosine receptor A1
Type:G Protein-Coupled Receptor (GPCR)
Mol. Mass.:36520.92
Organism:Homo sapiens (Human)
Description:P30542
Residue:326
BDBM50317876
NameBDBM50317876
Synonyms:(2R,3R,4S,5R)-2-(6-(1-hydroxy-2,2,6,6-tetramethylpiperidin-4-ylamino)-1H-purin-9(6H)-yl)-5-(hydroxymethyl)tetrahydrofuran-3,4-diol | CHEMBL1094353
TypeSmall organic molecule
Emp. Form.C19H32N6O5
Mol. Mass.424.4946
SMILESCC1(C)CC(CC(C)(C)N1O)NC1NC=Nc2c1ncn2[C@@H]1O[C@H](CO)[C@@H](O)[C@H]1O