Reaction Details
TargetAdenosine receptor A1
LigandBDBM50317880
Substrate/Competitorn/a
Meas. Tech.ChEMBL_630177 (CHEMBL1117280)
Ki 1170±n/a nM
Citation Devine, SMGregg, AFigler, HMcIntosh, KUrmaliya, VLinden, JPouton, CWWhite, PJBottle, SEScammells, PJ Synthesis and evaluation of new N6-substituted adenosine-5'-N-methylcarboxamides as A3 adenosine receptor agonists. Bioorg Med Chem18:3078-87 (2010) 
 
Adenosine receptor A1
Name:Adenosine receptor A1
Type:G Protein-Coupled Receptor (GPCR)
Mol. Mass.:36520.92
Organism:Homo sapiens (Human)
Description:P30542
Residue:326
BDBM50317880
NameBDBM50317880
Synonyms:CHEMBL1099126 | N6-(1,1,3,3-Tetramethylisoindolin-5-yl)adenosine-5'-Nmethylcarboxamide
TypeSmall organic molecule
Emp. Form.C23H29N7O4
Mol. Mass.467.5209
SMILESCNC(=O)[C@H]1O[C@H]([C@H](O)[C@@H]1O)n1cnc2c(Nc3ccc4c(c3)C(C)(C)NC4(C)C)ncnc12