Reaction Details
TargetAdenosine receptor A3
LigandBDBM50317891
Substrate/Competitorn/a
Meas. Tech.ChEMBL_630180 (CHEMBL1117283)
Ki 9.02±n/a nM
Citation Devine, SMGregg, AFigler, HMcIntosh, KUrmaliya, VLinden, JPouton, CWWhite, PJBottle, SEScammells, PJ Synthesis and evaluation of new N6-substituted adenosine-5'-N-methylcarboxamides as A3 adenosine receptor agonists. Bioorg Med Chem18:3078-87 (2010) 
 
Adenosine receptor A3
Name:Adenosine receptor A3
Type:G Protein-Coupled Receptor (GPCR)
Mol. Mass.:36197.32
Organism:Homo sapiens (Human)
Description:P0DMS8
Residue:318
BDBM50317891
NameBDBM50317891
Synonyms:CHEMBL1094999 | N6-[4-[2-[3,5-Di-tert-butylbenzamido]ethyl]benzyl]adenosine-5'-N-methylcarboxamide
TypeSmall organic molecule
Emp. Form.C34H43N7O5
Mol. Mass.629.7491
SMILESCNC(=O)[C@H]1O[C@H]([C@H](O)[C@@H]1O)n1cnc2c(NCc3ccc(CNC(=O)c4cc(cc(c4)C(C)(C)C)C(C)(C)C)cc3)ncnc12