Reaction Details
TargetAdenosine receptor A3
LigandBDBM50317878
Substrate/Competitorn/a
Meas. Tech.ChEMBL_630180 (CHEMBL1117283)
Ki 30±n/a nM
Citation Devine, SMGregg, AFigler, HMcIntosh, KUrmaliya, VLinden, JPouton, CWWhite, PJBottle, SEScammells, PJ Synthesis and evaluation of new N6-substituted adenosine-5'-N-methylcarboxamides as A3 adenosine receptor agonists. Bioorg Med Chem18:3078-87 (2010) 
 
Adenosine receptor A3
Name:Adenosine receptor A3
Type:G Protein-Coupled Receptor (GPCR)
Mol. Mass.:36197.32
Organism:Homo sapiens (Human)
Description:P0DMS8
Residue:318
BDBM50317878
NameBDBM50317878
Synonyms:CHEMBL1098520 | N6-(4-(2-Aminoethyl)-2,6-di-tert-butylphenol)adenosine
TypeSmall organic molecule
Emp. Form.C26H37N5O5
Mol. Mass.499.6025
SMILESCC(C)(C)c1cc(CCNc2ncnc3n(cnc23)[C@@H]2O[C@H](CO)[C@@H](O)[C@H]2O)cc(c1O)C(C)(C)C