Reaction Details
TargetAdenosine receptor A3
LigandBDBM50317883
Substrate/Competitorn/a
Meas. Tech.ChEMBL_630180 (CHEMBL1117283)
Ki 2480±n/a nM
Citation Devine, SMGregg, AFigler, HMcIntosh, KUrmaliya, VLinden, JPouton, CWWhite, PJBottle, SEScammells, PJ Synthesis and evaluation of new N6-substituted adenosine-5'-N-methylcarboxamides as A3 adenosine receptor agonists. Bioorg Med Chem18:3078-87 (2010) 
 
Adenosine receptor A3
Name:Adenosine receptor A3
Type:G Protein-Coupled Receptor (GPCR)
Mol. Mass.:36197.32
Organism:Homo sapiens (Human)
Description:P0DMS8
Residue:318
BDBM50317883
NameBDBM50317883
Synonyms:CHEMBL1099129 | N6-(2,2,6,6-Tetramethylpiperidin-4-yl)adenosine-5'-Nmethylcarboxamide
TypeSmall organic molecule
Emp. Form.C20H31N7O4
Mol. Mass.433.5046
SMILESCNC(=O)[C@H]1O[C@H]([C@H](O)[C@@H]1O)n1cnc2c(NC3CC(C)(C)NC(C)(C)C3)ncnc12