Reaction Details
TargetMitogen-activated protein kinase 14
LigandBDBM50318049
Substrate/Competitorn/a
Meas. Tech.ChEMBL_631194 (CHEMBL1110043)
IC50 15±n/a nM
Citation Jerome, KDHepperle, MEWalker, JKXing, LDevraj, RVBenson, AGBaldus, JESelness, SR Discovery of 5-substituted-N-arylpyridazinones as inhibitors of p38 MAP kinase. Bioorg Med Chem Lett20:3146-9 (2010) 
 
Mitogen-activated protein kinase 14
Name:Mitogen-activated protein kinase 14
Type:Serine/threonine-protein kinase
Mol. Mass.:41286.76
Organism:Homo sapiens (Human)
Description:Q16539
Residue:360
BDBM50318049
NameBDBM50318049
Synonyms:3-(5-bromo-4-(2,4-difluorobenzyloxy)-6-oxopyridazin-1(6H)-yl)-N,4-dimethylbenzamide | CHEMBL1097021
TypeSmall organic molecule
Emp. Form.C20H16BrF2N3O3
Mol. Mass.464.26
SMILESCNC(=O)c1ccc(C)c(c1)-n1ncc(OCc2ccc(F)cc2F)c(Br)c1=O