Reaction Details
TargetAldo-keto reductase family 1 member B1 [K65Q]
LigandBDBM7461
Substrate/Competitorn/a
Meas. Tech.ChEMBL_631366 (CHEMBL1109118)
IC50 7790±n/a nM
Citation Zou, XQPeng, SMHu, CPTan, LFYuan, QDeng, HWLi, YJ Synthesis, characterization and vasculoprotective effects of nitric oxide-donating derivatives of chrysin. Bioorg Med Chem18:3020-5 (2010) 
 
Aldo-keto reductase family 1 member B1 [K65Q]
Name:Aldo-keto reductase family 1 member B1 [K65Q]
Type:Protein
Mol. Mass.:35916.27
Organism:Bos taurus (Cattle)
Description:P16116[K65Q]
Residue:315
BDBM7461
NameBDBM7461
Synonyms:5,7-dihydroxy-2-phenyl-4H-chromen-4-one 5,7-dihydroxyflavone chrysin | cid_5281607
TypeSmall organic molecule
Emp. Form.C15H10O4
Mol. Mass.254.2375
SMILESOc1cc(O)c2c(c1)oc(cc2=O)-c1ccccc1