Reaction Details
TargetAldo-keto reductase family 1 member B1 [K65Q]
LigandBDBM50318060
Substrate/Competitorn/a
Meas. Tech.ChEMBL_631366 (CHEMBL1109118)
IC50 420±n/a nM
Citation Zou, XQPeng, SMHu, CPTan, LFYuan, QDeng, HWLi, YJ Synthesis, characterization and vasculoprotective effects of nitric oxide-donating derivatives of chrysin. Bioorg Med Chem18:3020-5 (2010) 
 
Aldo-keto reductase family 1 member B1 [K65Q]
Name:Aldo-keto reductase family 1 member B1 [K65Q]
Type:Protein
Mol. Mass.:35916.27
Organism:Bos taurus (Cattle)
Description:P16116[K65Q]
Residue:315
BDBM50318060
NameBDBM50318060
Synonyms:7-(6-(nitrooxy)hexyloxy)-4-oxo-2-phenyl-4H-chromen-5-yl acetate | CHEMBL1096050
TypeSmall organic molecule
Emp. Form.C23H23NO8
Mol. Mass.441.4306
SMILESCC(=O)Oc1cc(OCCCCCCO[N+]([O-])=O)cc2oc(cc(=O)c12)-c1ccccc1