Reaction Details
TargetCyclin-A1/Cyclin-A2/Cyclin-dependent kinase 2
LigandBDBM50318088
Substrate/Competitorn/a
Meas. Tech.ChEMBL_631393 (CHEMBL1109145)
IC50 2±n/a nM
Citation Beria, IBallinari, DBertrand, JABorghi, DBossi, RTBrasca, MGCappella, PCaruso, MCeccarelli, WCiavolella, ACristiani, CCroci, VDe Ponti, AFachin, GFerguson, RDLansen, JMoll, JKPesenti, EPosteri, HPerego, RRocchetti, MStorici, PVolpi, DValsasina, B Identification of 4,5-dihydro-1H-pyrazolo[4,3-h]quinazoline derivatives as a new class of orally and selective Polo-like kinase 1 inhibitors. J Med Chem53:3532-51 (2010) 
 
Cyclin-A1/Cyclin-A2/Cyclin-dependent kinase 2
Name:Cyclin-A1/Cyclin-A2/Cyclin-dependent kinase 2
Type:n/a
Mol. Mass.:n/a
Description:ASSAY_ID of EBI is 42813
Components:This complex has 3 components.
Component 1
Name:Cyclin-A2
Synonyms:CCN1 CCNA1 CCNA2_HUMAN Cyclin-A
Type:Enzyme Subunit
Mol. Mass.:48550.19
Organism:Homo sapiens (Human)
Description:P20248
Residue:432
Component 2
Name:Cyclin-A1
Synonyms:CCNA1 CDK2/Cyclin A1 Cyclin-A1/Cyclin-dependent kinase 4
Type:Enzyme
Mol. Mass.:52343.37
Organism:Homo sapiens (Human)
Description:P78396
Residue:465
Component 3
Name:Cyclin-dependent kinase 2
Synonyms:CDK2 CDK2_HUMAN Cell division protein kinase 2 Protein cereblon/Cyclin-dependent kinase 2 | p33 protein kinase
Type:Enzyme Subunit
Mol. Mass.:33938.17
Organism:Homo sapiens (Human)
Description:P24941
Residue:298
Component 4
Name:Cyclin-A2
Synonyms:CCN1 CCNA1 CCNA2_HUMAN Cyclin-A
Type:Enzyme Subunit
Mol. Mass.:48550.19
Organism:Homo sapiens (Human)
Description:P20248
Residue:432
BDBM50318088
NameBDBM50318088
Synonyms:8-[(3-Acetylphenyl)amino]-1-methyl-4,5-dihydro-1H-pyrazolo-[4,3-h]quinazoline-3-carboxamide | CHEMBL1099105
TypeSmall organic molecule
Emp. Form.C19H18N6O2
Mol. Mass.362.3852
SMILESCC(=O)c1cccc(Nc2ncc3CCc4c(nn(C)c4-c3n2)C(N)=O)c1