Reaction Details
TargetAurora kinase A
LigandBDBM50318092
Substrate/Competitorn/a
Meas. Tech.ChEMBL_631394 (CHEMBL1109146)
IC50 42±n/a nM
Citation Beria, IBallinari, DBertrand, JABorghi, DBossi, RTBrasca, MGCappella, PCaruso, MCeccarelli, WCiavolella, ACristiani, CCroci, VDe Ponti, AFachin, GFerguson, RDLansen, JMoll, JKPesenti, EPosteri, HPerego, RRocchetti, MStorici, PVolpi, DValsasina, B Identification of 4,5-dihydro-1H-pyrazolo[4,3-h]quinazoline derivatives as a new class of orally and selective Polo-like kinase 1 inhibitors. J Med Chem53:3532-51 (2010) 
 
Aurora kinase A
Name:Aurora kinase A
Type:Serine/threonine-protein kinase
Mol. Mass.:45830.98
Organism:Homo sapiens (Human)
Description:O14965
Residue:403
BDBM50318092
NameBDBM50318092
Synonyms:8-(Phenylamino)-1-(2,2,2-trifluoroethyl)-4,5-dihydro-1H-pyrazolo[4,3-h]quinazoline-3-carboxamide | CHEMBL1095709
TypeSmall organic molecule
Emp. Form.C18H15F3N6O
Mol. Mass.388.3465
SMILESNC(=O)c1nn(CC(F)(F)F)c-2c1CCc1cnc(Nc3ccccc3)nc-21