Reaction Details
TargetSerine/threonine-protein kinase PLK3
LigandBDBM50318076
Substrate/Competitorn/a
Meas. Tech.ChEMBL_631391 (CHEMBL1109143)
IC50 16±n/a nM
Citation Beria, IBallinari, DBertrand, JABorghi, DBossi, RTBrasca, MGCappella, PCaruso, MCeccarelli, WCiavolella, ACristiani, CCroci, VDe Ponti, AFachin, GFerguson, RDLansen, JMoll, JKPesenti, EPosteri, HPerego, RRocchetti, MStorici, PVolpi, DValsasina, B Identification of 4,5-dihydro-1H-pyrazolo[4,3-h]quinazoline derivatives as a new class of orally and selective Polo-like kinase 1 inhibitors. J Med Chem53:3532-51 (2010) 
 
Serine/threonine-protein kinase PLK3
Name:Serine/threonine-protein kinase PLK3
Type:Serine/threonine-protein kinase
Mol. Mass.:71655.17
Organism:Homo sapiens (Human)
Description:Enzyme assays were using PLK3 purified from baculovirus-infected Trichoplusia ni cells expressing full-length PLK3.
Residue:646
BDBM50318076
NameBDBM50318076
Synonyms:1-Methyl-8-{[2-(methylsulfanyl)phenyl]amino}-4,5-dihydro-1Hpyrazolo[4,3-h]quinazoline-3-carboxamide | CHEMBL1094478
TypeSmall organic molecule
Emp. Form.C18H18N6OS
Mol. Mass.366.44
SMILESCSc1ccccc1Nc1ncc2CCc3c(nn(C)c3-c2n1)C(N)=O