Reaction Details
TargetHistamine H3 receptor
LigandBDBM50318104
Substrate/Competitorn/a
Meas. Tech.ChEMBL_631946 (CHEMBL1104702)
Ki 129±n/a nM
Citation Watanabe, MHirokawa, TKobayashi, TYoshida, AIto, YYamada, SOrimoto, NYamasaki, YArisawa, MShuto, S Investigation of the bioactive conformation of histamine H3 receptor antagonists by the cyclopropylic strain-based conformational restriction strategy. J Med Chem53:3585-93 (2010) 
 
Histamine H3 receptor
Name:Histamine H3 receptor
Type:G Protein-Coupled Receptor (GPCR)
Mol. Mass.:48691.47
Organism:Homo sapiens (Human)
Description:Binding assays were using CHO cells stably expressing hH3R receptors.
Residue:445
BDBM50318104
NameBDBM50318104
Synonyms:(1R,2S)-2-[(1S)-1-Ethyl-2-(4-chlorobenzylamino)ethyl]-1-(1H-imidazol-4-yl)cyclopropane | CHEMBL1094410
TypeSmall organic molecule
Emp. Form.C17H22ClN3
Mol. Mass.303.83
SMILESCC[C@H](CNCc1ccc(Cl)cc1)[C@@H]1C[C@H]1c1cnc[nH]1