Reaction Details
TargetHistamine H3 receptor
LigandBDBM50194203
Substrate/Competitorn/a
Meas. Tech.ChEMBL_631946 (CHEMBL1104702)
Ki 8.4±n/a nM
Citation Watanabe, MHirokawa, TKobayashi, TYoshida, AIto, YYamada, SOrimoto, NYamasaki, YArisawa, MShuto, S Investigation of the bioactive conformation of histamine H3 receptor antagonists by the cyclopropylic strain-based conformational restriction strategy. J Med Chem53:3585-93 (2010) 
 
Histamine H3 receptor
Name:Histamine H3 receptor
Type:G Protein-Coupled Receptor (GPCR)
Mol. Mass.:48691.47
Organism:Homo sapiens (Human)
Description:Binding assays were using CHO cells stably expressing hH3R receptors.
Residue:445
BDBM50194203
NameBDBM50194203
Synonyms:(1R,2R)-cis-2-[2-(4-chlorobenzylamino)ethyl]-1-(1H-imidazol-4-yl)cyclopropane | CHEMBL377572
TypeSmall organic molecule
Emp. Form.C15H18ClN3
Mol. Mass.275.777
SMILESClc1ccc(CNCC[C@H]2C[C@H]2c2cnc[nH]2)cc1