Reaction Details
TargetInsulin-like growth factor 1 receptor
LigandBDBM50318112
Substrate/Competitorn/a
Meas. Tech.ChEMBL_632103 (CHEMBL1115499)
IC50 16±n/a nM
Citation Velaparthi, USaulnier, MGWittman, MDLiu, PFrennesson, DBZimmermann, KCarboni, JMGottardis, MLi, AGreer, AClarke, WYang, ZMenard, KLee, FYTrainor, GVyas, D Insulin-like growth factor-1 receptor (IGF-1R) kinase inhibitors: SAR of a series of 3-[6-(4-substituted-piperazin-1-yl)-4-methyl-1H-benzimidazol-2-yl]-1H-pyridine-2-one. Bioorg Med Chem Lett20:3182-5 (2010) 
 
Insulin-like growth factor 1 receptor
Name:Insulin-like growth factor 1 receptor
Type:Protein
Mol. Mass.:154776.79
Organism:Homo sapiens (Human)
Description:P08069
Residue:1367
BDBM50318112
NameBDBM50318112
Synonyms:(S)-4-(2-(3-chlorophenyl)-2-hydroxyethylamino)-3-(6-(4-(2-methoxyethyl)piperazin-1-yl)-4-methyl-1H-benzo[d]imidazol-2-yl)pyridin-2(1H)-one CHEMBL1094165
TypeSmall organic molecule
Emp. Form.C28H33ClN6O3
Mol. Mass.537.053
SMILESCOCCN1CCN(CC1)c1cc(C)c2nc([nH]c2c1)-c1c(NC[C@@H](O)c2cccc(Cl)c2)cc[nH]c1=O