Reaction Details
TargetBeta-secretase 1
LigandBDBM50318129
Substrate/Competitorn/a
Meas. Tech.ChEMBL_632138 (CHEMBL1103872)
Ki 20±n/a nM
Citation Huang, YStrobel, EDHo, CYReynolds, CHConway, KAPiesvaux, JABrenneman, DEYohrling, GJMoore Arnold, HRosenthal, DAlexander, RSTounge, BAMercken, MVandermeeren, MParker, MHReitz, ABBaxter, EW Macrocyclic BACE inhibitors: Optimization of a micromolar hit to nanomolar leads. Bioorg Med Chem Lett20:3158-60 (2010) 
 
Beta-secretase 1
Name:Beta-secretase 1
Type:Protein
Mol. Mass.:55755.10
Organism:Homo sapiens (Human)
Description:P56817
Residue:501
BDBM50318129
NameBDBM50318129
Synonyms:4-[(14S)-16-amino-14-cyclohexyl-11-oxo-2-oxa-10,15,17-triazatetracyclo[13.5.3.1^{3,7}.0^{18,22}]tetracosa-1(21),3(24),4,6,16,18(22),19-heptaen-10-yl]cyclohexane-1-carboxylic acid | CHEMBL1097281
TypeSmall organic molecule
Emp. Form.C33H42N4O4
Mol. Mass.558.711
SMILESNC1=Nc2ccc3Oc4cccc(CCN([C@H]5CC[C@H](CC5)C(O)=O)C(=O)CC[C@@H](C5CCCCC5)N1Cc2c3)c4