Reaction Details
TargetEpidermal growth factor receptor
LigandBDBM50271758
Substrate/Competitorn/a
Meas. Tech.ChEMBL_632393 (CHEMBL1115598)
IC50 300±n/a nM
Citation Gangjee, ANamjoshi, OAIhnat, MABuchanan, A The contribution of a 2-amino group on receptor tyrosine kinase inhibition and antiangiogenic activity in 4-anilinosubstituted pyrrolo[2,3-d]pyrimidines. Bioorg Med Chem Lett20:3177-81 (2010) 
 
Epidermal growth factor receptor
Name:Epidermal growth factor receptor
Type:Receptor Kinase Domain
Mol. Mass.:134279.59
Organism:Homo sapiens (Human)
Description:P00533
Residue:1210
BDBM50271758
NameBDBM50271758
Synonyms:CHEMBL485320 N4-(3-bromophenyl)-6-phenethyl-7H-pyrrolo[2,3-d]pyrimidine-2,4-diamine
TypeSmall organic molecule
Emp. Form.C20H18BrN5
Mol. Mass.408.294
SMILESNc1nc(Nc2cccc(Br)c2)c2cc(CCc3ccccc3)[nH]c2n1