Reaction Details
TargetVascular endothelial growth factor receptor 1
LigandBDBM50318162
Substrate/Competitorn/a
Meas. Tech.ChEMBL_632394 (CHEMBL1115599)
IC50 129400±n/a nM
Citation Gangjee, ANamjoshi, OAIhnat, MABuchanan, A The contribution of a 2-amino group on receptor tyrosine kinase inhibition and antiangiogenic activity in 4-anilinosubstituted pyrrolo[2,3-d]pyrimidines. Bioorg Med Chem Lett20:3177-81 (2010) 
 
Vascular endothelial growth factor receptor 1
Name:Vascular endothelial growth factor receptor 1
Type:Receptor Tyrosine Kinase
Mol. Mass.:150800.23
Organism:Homo sapiens (Human)
Description:P17948
Residue:1338
BDBM50318162
NameBDBM50318162
Synonyms:CHEMBL1094423 | N-(3-bromophenyl)-6-(2-phenylethyl)-7H-pyrrolo[2,3-d]pyrimidin-4-amine
TypeSmall organic molecule
Emp. Form.C20H17BrN4
Mol. Mass.393.28
SMILESBrc1cccc(Nc2ncnc3[nH]c(CCc4ccccc4)cc23)c1