Reaction Details
TargetVascular endothelial growth factor receptor 1
LigandBDBM50271849
Substrate/Competitorn/a
Meas. Tech.ChEMBL_632394 (CHEMBL1115599)
IC50>200000±n/a nM
Citation Gangjee, ANamjoshi, OAIhnat, MABuchanan, A The contribution of a 2-amino group on receptor tyrosine kinase inhibition and antiangiogenic activity in 4-anilinosubstituted pyrrolo[2,3-d]pyrimidines. Bioorg Med Chem Lett20:3177-81 (2010) 
 
Vascular endothelial growth factor receptor 1
Name:Vascular endothelial growth factor receptor 1
Type:Receptor Tyrosine Kinase
Mol. Mass.:150800.23
Organism:Homo sapiens (Human)
Description:P17948
Residue:1338
BDBM50271849
NameBDBM50271849
Synonyms:CHEMBL520803 N4-(3-ethynylphenyl)-6-phenethyl-7H-pyrrolo[2,3-d]pyrimidine-2,4-diamine
TypeSmall organic molecule
Emp. Form.C22H19N5
Mol. Mass.353.4198
SMILESNc1nc(Nc2cccc(c2)C#C)c2cc(CCc3ccccc3)[nH]c2n1