Reaction Details
TargetVascular endothelial growth factor receptor 2
LigandBDBM50271803
Substrate/Competitorn/a
Meas. Tech.ChEMBL_632395 (CHEMBL1115600)
IC50 132100±n/a nM
Citation Gangjee, ANamjoshi, OAIhnat, MABuchanan, A The contribution of a 2-amino group on receptor tyrosine kinase inhibition and antiangiogenic activity in 4-anilinosubstituted pyrrolo[2,3-d]pyrimidines. Bioorg Med Chem Lett20:3177-81 (2010) 
 
Vascular endothelial growth factor receptor 2
Name:Vascular endothelial growth factor receptor 2
Type:Receptor Tyrosine Kinase
Mol. Mass.:151510.97
Organism:Homo sapiens (Human)
Description:P35968
Residue:1356
BDBM50271803
NameBDBM50271803
Synonyms:CHEMBL483108 N4-(3-bromo-4-fluorophenyl)-6-phenethyl-7H-pyrrolo[2,3-d]pyrimidine-2,4-diamine
TypeSmall organic molecule
Emp. Form.C20H17BrFN5
Mol. Mass.426.285
SMILESNc1nc(Nc2ccc(F)c(Br)c2)c2cc(CCc3ccccc3)[nH]c2n1