Reaction Details
TargetVascular endothelial growth factor receptor 2
LigandBDBM50271852
Substrate/Competitorn/a
Meas. Tech.ChEMBL_632395 (CHEMBL1115600)
IC50>200000±n/a nM
Citation Gangjee, ANamjoshi, OAIhnat, MABuchanan, A The contribution of a 2-amino group on receptor tyrosine kinase inhibition and antiangiogenic activity in 4-anilinosubstituted pyrrolo[2,3-d]pyrimidines. Bioorg Med Chem Lett20:3177-81 (2010) 
 
Vascular endothelial growth factor receptor 2
Name:Vascular endothelial growth factor receptor 2
Type:Receptor Tyrosine Kinase
Mol. Mass.:151510.97
Organism:Homo sapiens (Human)
Description:P35968
Residue:1356
BDBM50271852
NameBDBM50271852
Synonyms:CHEMBL482715 N4-[4-Fluoro-3-(trifluoromethyl)phenyl]-6-(2-phenylethyl)-7H-pyrrolo[2,3-d]pyrimidine-2,4-diamine
TypeSmall organic molecule
Emp. Form.C21H17F4N5
Mol. Mass.415.3868
SMILESNc1nc(Nc2ccc(F)c(c2)C(F)(F)F)c2cc(CCc3ccccc3)[nH]c2n1