Reaction Details
TargetPlatelet-derived growth factor receptor beta
LigandBDBM50271849
Substrate/Competitorn/a
Meas. Tech.ChEMBL_632396 (CHEMBL1115601)
IC50 100400±n/a nM
Citation Gangjee, ANamjoshi, OAIhnat, MABuchanan, A The contribution of a 2-amino group on receptor tyrosine kinase inhibition and antiangiogenic activity in 4-anilinosubstituted pyrrolo[2,3-d]pyrimidines. Bioorg Med Chem Lett20:3177-81 (2010) 
 
Platelet-derived growth factor receptor beta
Name:Platelet-derived growth factor receptor beta
Type:Enzyme
Mol. Mass.:123922.25
Organism:Homo sapiens (Human)
Description:P09619
Residue:1106
BDBM50271849
NameBDBM50271849
Synonyms:CHEMBL520803 N4-(3-ethynylphenyl)-6-phenethyl-7H-pyrrolo[2,3-d]pyrimidine-2,4-diamine
TypeSmall organic molecule
Emp. Form.C22H19N5
Mol. Mass.353.4198
SMILESNc1nc(Nc2cccc(c2)C#C)c2cc(CCc3ccccc3)[nH]c2n1