Reaction Details
TargetPlatelet-derived growth factor receptor beta
LigandBDBM50318164
Substrate/Competitorn/a
Meas. Tech.ChEMBL_632396 (CHEMBL1115601)
IC50>500000±n/a nM
Citation Gangjee, ANamjoshi, OAIhnat, MABuchanan, A The contribution of a 2-amino group on receptor tyrosine kinase inhibition and antiangiogenic activity in 4-anilinosubstituted pyrrolo[2,3-d]pyrimidines. Bioorg Med Chem Lett20:3177-81 (2010) 
 
Platelet-derived growth factor receptor beta
Name:Platelet-derived growth factor receptor beta
Type:Enzyme
Mol. Mass.:123922.25
Organism:Homo sapiens (Human)
Description:P09619
Residue:1106
BDBM50318164
NameBDBM50318164
Synonyms:6-(2-Phenylethyl)-N-[3-(trifluoromethyl)phenyl]-7H-pyrrolo[2,3-d]pyrimidin-4-amine | CHEMBL1097743
TypeSmall organic molecule
Emp. Form.C21H17F3N4
Mol. Mass.382.3817
SMILESFC(F)(F)c1cccc(Nc2ncnc3[nH]c(CCc4ccccc4)cc23)c1