Reaction Details
TargetPlatelet-derived growth factor receptor beta
LigandBDBM50318166
Substrate/Competitorn/a
Meas. Tech.ChEMBL_632396 (CHEMBL1115601)
IC50>500000±n/a nM
Citation Gangjee, ANamjoshi, OAIhnat, MABuchanan, A The contribution of a 2-amino group on receptor tyrosine kinase inhibition and antiangiogenic activity in 4-anilinosubstituted pyrrolo[2,3-d]pyrimidines. Bioorg Med Chem Lett20:3177-81 (2010) 
 
Platelet-derived growth factor receptor beta
Name:Platelet-derived growth factor receptor beta
Type:Enzyme
Mol. Mass.:123922.25
Organism:Homo sapiens (Human)
Description:P09619
Residue:1106
BDBM50318166
NameBDBM50318166
Synonyms:CHEMBL1096415 | N-[4-fluoro-3-(trifluoromethyl)phenyl]-6-(2-phenylethyl)-7H-pyrrolo[2,3-d]pyrimidin-4-amine
TypeSmall organic molecule
Emp. Form.C21H16F4N4
Mol. Mass.400.3722
SMILESFc1ccc(Nc2ncnc3[nH]c(CCc4ccccc4)cc23)cc1C(F)(F)F