Reaction Details
TargetPlatelet-derived growth factor receptor beta
LigandBDBM50318168
Substrate/Competitorn/a
Meas. Tech.ChEMBL_632396 (CHEMBL1115601)
IC50 104200±n/a nM
Citation Gangjee, ANamjoshi, OAIhnat, MABuchanan, A The contribution of a 2-amino group on receptor tyrosine kinase inhibition and antiangiogenic activity in 4-anilinosubstituted pyrrolo[2,3-d]pyrimidines. Bioorg Med Chem Lett20:3177-81 (2010) 
 
Platelet-derived growth factor receptor beta
Name:Platelet-derived growth factor receptor beta
Type:Enzyme
Mol. Mass.:123922.25
Organism:Homo sapiens (Human)
Description:P09619
Residue:1106
BDBM50318168
NameBDBM50318168
Synonyms:CHEMBL1097368 | N-1H-indol-5-yl-6-(2-phenylethyl)-7H-pyrrolo[2,3-d]pyrimidin-4-amine
TypeSmall organic molecule
Emp. Form.C22H19N5
Mol. Mass.353.4198
SMILESC(Cc1ccccc1)c1cc2c(Nc3ccc4[nH]ccc4c3)ncnc2[nH]1