Reaction Details
TargetPlatelet-derived growth factor receptor beta
LigandBDBM33408
Substrate/Competitorn/a
Meas. Tech.ChEMBL_632396 (CHEMBL1115601)
IC50 6500±n/a nM
Citation Gangjee, ANamjoshi, OAIhnat, MABuchanan, A The contribution of a 2-amino group on receptor tyrosine kinase inhibition and antiangiogenic activity in 4-anilinosubstituted pyrrolo[2,3-d]pyrimidines. Bioorg Med Chem Lett20:3177-81 (2010) 
 
Platelet-derived growth factor receptor beta
Name:Platelet-derived growth factor receptor beta
Type:Enzyme
Mol. Mass.:123922.25
Organism:Homo sapiens (Human)
Description:P09619
Residue:1106
BDBM33408
NameBDBM33408
Synonyms:AG1295 cid_2048
TypeSmall organic molecule
Emp. Form.C16H14N2
Mol. Mass.234.2958
SMILESCc1cc2ncc(nc2cc1C)-c1ccccc1