Reaction Details
TargetEpidermal growth factor receptor
LigandBDBM50318178
Substrate/Competitorn/a
Meas. Tech.ChEMBL_632680 (CHEMBL1112818)
IC50 55200±n/a nM
Citation Gangjee, AKurup, SIhnat, MAThorpe, JEShenoy, SS Synthesis and biological activity of N(4)-phenylsubstituted-6-(2,4-dichloro phenylmethyl)-7H-pyrrolo[2,3-d]pyrimidine-2,4-diamines as vascular endothelial growth factor receptor-2 inhibitors and antiangiogenic and antitumor agents. Bioorg Med Chem18:3575-87 (2010) 
 
Epidermal growth factor receptor
Name:Epidermal growth factor receptor
Type:Receptor Kinase Domain
Mol. Mass.:134279.59
Organism:Homo sapiens (Human)
Description:P00533
Residue:1210
BDBM50318178
NameBDBM50318178
Synonyms:CHEMBL1094475 | N4-(3-Ethynylphenyl)-6-(2,4-dichlorobenzyl)-7Hpyrrolo[2,3-d]pyrimidine-2,4-diamine
TypeSmall organic molecule
Emp. Form.C21H15Cl2N5
Mol. Mass.408.283
SMILESNc1nc(Nc2cccc(c2)C#C)c2cc(Cc3ccc(Cl)cc3Cl)[nH]c2n1