Reaction Details
TargetPlatelet-derived growth factor receptor beta
LigandBDBM50318179
Substrate/Competitorn/a
Meas. Tech.ChEMBL_632681 (CHEMBL1112819)
IC50>300000±n/a nM
Citation Gangjee, AKurup, SIhnat, MAThorpe, JEShenoy, SS Synthesis and biological activity of N(4)-phenylsubstituted-6-(2,4-dichloro phenylmethyl)-7H-pyrrolo[2,3-d]pyrimidine-2,4-diamines as vascular endothelial growth factor receptor-2 inhibitors and antiangiogenic and antitumor agents. Bioorg Med Chem18:3575-87 (2010) 
 
Platelet-derived growth factor receptor beta
Name:Platelet-derived growth factor receptor beta
Type:Enzyme
Mol. Mass.:123922.25
Organism:Homo sapiens (Human)
Description:P09619
Residue:1106
BDBM50318179
NameBDBM50318179
Synonyms:CHEMBL1094808 | N4-(3-Fluoro-4-trifluoromethylphenyl)-6-(2,4-dichlorobenzyl)-7H-pyrrolo[2,3-d]pyrimidine-2,4-diamine
TypeSmall organic molecule
Emp. Form.C20H13Cl2F4N5
Mol. Mass.470.25
SMILESNc1nc(Nc2ccc(c(F)c2)C(F)(F)F)c2cc(Cc3ccc(Cl)cc3Cl)[nH]c2n1