Reaction Details
TargetPlatelet-derived growth factor receptor beta
LigandBDBM17747
Substrate/Competitorn/a
Meas. Tech.ChEMBL_632681 (CHEMBL1112819)
IC50 3700±n/a nM
Citation Gangjee, AKurup, SIhnat, MAThorpe, JEShenoy, SS Synthesis and biological activity of N(4)-phenylsubstituted-6-(2,4-dichloro phenylmethyl)-7H-pyrrolo[2,3-d]pyrimidine-2,4-diamines as vascular endothelial growth factor receptor-2 inhibitors and antiangiogenic and antitumor agents. Bioorg Med Chem18:3575-87 (2010) 
 
Platelet-derived growth factor receptor beta
Name:Platelet-derived growth factor receptor beta
Type:Enzyme
Mol. Mass.:123922.25
Organism:Homo sapiens (Human)
Description:P09619
Residue:1106
BDBM17747
NameBDBM17747
Synonyms:(3Z)-3-{[4-(dimethylamino)phenyl]methylidene}-2,3-dihydro-1H-indol-2-one SU 4312 | SU4312
TypeSmall organic molecule
Emp. Form.C17H16N2O
Mol. Mass.264.3217
SMILESCN(C)c1ccc(\C=C2/C(=O)Nc3ccccc23)cc1