Reaction Details
TargetVascular endothelial growth factor receptor 1
LigandBDBM50318185
Substrate/Competitorn/a
Meas. Tech.ChEMBL_632679 (CHEMBL1112817)
IC50>300000±n/a nM
Citation Gangjee, AKurup, SIhnat, MAThorpe, JEShenoy, SS Synthesis and biological activity of N(4)-phenylsubstituted-6-(2,4-dichloro phenylmethyl)-7H-pyrrolo[2,3-d]pyrimidine-2,4-diamines as vascular endothelial growth factor receptor-2 inhibitors and antiangiogenic and antitumor agents. Bioorg Med Chem18:3575-87 (2010) 
 
Vascular endothelial growth factor receptor 1
Name:Vascular endothelial growth factor receptor 1
Type:Receptor Tyrosine Kinase
Mol. Mass.:150800.23
Organism:Homo sapiens (Human)
Description:P17948
Residue:1338
BDBM50318185
NameBDBM50318185
Synonyms:CHEMBL1094782 | N-(3-bromophenyl)-6-(2,5-dimethoxybenzyl)-7H-pyrrolo[2,3-d]pyrimidin-4-amine
TypeSmall organic molecule
Emp. Form.C21H19BrN4O2
Mol. Mass.439.305
SMILESCOc1ccc(OC)c(Cc2cc3c(Nc4cccc(Br)c4)ncnc3[nH]2)c1