Reaction Details
TargetVascular endothelial growth factor receptor 1
LigandBDBM50318187
Substrate/Competitorn/a
Meas. Tech.ChEMBL_632679 (CHEMBL1112817)
IC50>300000±n/a nM
Citation Gangjee, AKurup, SIhnat, MAThorpe, JEShenoy, SS Synthesis and biological activity of N(4)-phenylsubstituted-6-(2,4-dichloro phenylmethyl)-7H-pyrrolo[2,3-d]pyrimidine-2,4-diamines as vascular endothelial growth factor receptor-2 inhibitors and antiangiogenic and antitumor agents. Bioorg Med Chem18:3575-87 (2010) 
 
Vascular endothelial growth factor receptor 1
Name:Vascular endothelial growth factor receptor 1
Type:Receptor Tyrosine Kinase
Mol. Mass.:150800.23
Organism:Homo sapiens (Human)
Description:P17948
Residue:1338
BDBM50318187
NameBDBM50318187
Synonyms:6-(2,4-dichlorobenzyl)-N-(3-(trifluoromethyl)phenyl)-7H-pyrrolo[2,3-d]pyrimidin-4-amine | CHEMBL1094784
TypeSmall organic molecule
Emp. Form.C20H13Cl2F3N4
Mol. Mass.437.245
SMILESFC(F)(F)c1cccc(Nc2ncnc3[nH]c(Cc4ccc(Cl)cc4Cl)cc23)c1