Reaction Details
TargetPlatelet-derived growth factor receptor beta
LigandBDBM50318184
Substrate/Competitorn/a
Meas. Tech.ChEMBL_632681 (CHEMBL1112819)
IC50 182000±n/a nM
Citation Gangjee, AKurup, SIhnat, MAThorpe, JEShenoy, SS Synthesis and biological activity of N(4)-phenylsubstituted-6-(2,4-dichloro phenylmethyl)-7H-pyrrolo[2,3-d]pyrimidine-2,4-diamines as vascular endothelial growth factor receptor-2 inhibitors and antiangiogenic and antitumor agents. Bioorg Med Chem18:3575-87 (2010) 
 
Platelet-derived growth factor receptor beta
Name:Platelet-derived growth factor receptor beta
Type:Enzyme
Mol. Mass.:123922.25
Organism:Homo sapiens (Human)
Description:P09619
Residue:1106
BDBM50318184
NameBDBM50318184
Synonyms:CHEMBL1095466 | N-(3-bromophenyl)-6-(2-methylbenzyl)-7H-pyrrolo[2,3-d]pyrimidin-4-amine
TypeSmall organic molecule
Emp. Form.C20H17BrN4
Mol. Mass.393.28
SMILESCc1ccccc1Cc1cc2c(Nc3cccc(Br)c3)ncnc2[nH]1